Print

Print


Hi everyone,

   As Jeremy asked me during the phone meeting, here is the error 
message I obtain when trying to build hps-java this morming. A new 
install gives the same result.

[INFO] Building conditions 3.0.2-SNAPSHOT
[INFO] 
------------------------------------------------------------------------
[INFO]
[INFO] --- maven-clean-plugin:2.4.1:clean (default-clean) @ 
hps-conditions ---
[INFO] Deleting /vol0/charlesg-l/Bureau/Docs/hps_db2/conditions/target
[INFO]
[INFO] --- maven-resources-plugin:2.5:resources (default-resources) @ 
hps-conditions ---
[debug] execute contextualize
[INFO] Using 'UTF-8' encoding to copy filtered resources.
[INFO] Copying 52 resources
[INFO]
[INFO] --- maven-compiler-plugin:3.1:compile (default-compile) @ 
hps-conditions ---
[INFO] Changes detected - recompiling the module!
[INFO] Compiling 55 source files to 
/vol0/charlesg-l/Bureau/Docs/hps_db2/conditions/target/classes
[INFO] -------------------------------------------------------------
[WARNING] COMPILATION WARNING :
[INFO] -------------------------------------------------------------
[WARNING] 
/vol0/charlesg-l/Bureau/Docs/hps_db2/conditions/src/main/java/org/hps/conditions/ConditionsObjectConverter.java: 
Some input files use unchecked or unsafe operations.
[WARNING] 
/vol0/charlesg-l/Bureau/Docs/hps_db2/conditions/src/main/java/org/hps/conditions/ConditionsObjectConverter.java: 
Recompile with -Xlint:unchecked for details.
[INFO] 2 warnings
[INFO] -------------------------------------------------------------
[INFO] -------------------------------------------------------------
[ERROR] COMPILATION ERROR :
[INFO] -------------------------------------------------------------
[ERROR] 
/vol0/charlesg-l/Bureau/Docs/hps_db2/conditions/src/main/java/org/hps/conditions/ecal/EcalConditionsLoader.java:[35,20] 
cannot find symbol
   symbol:   method reset()
   location: variable crystal of type 
org.lcsim.detector.converter.compact.EcalCrystal
[INFO] 1 error
[INFO] -------------------------------------------------------------
[INFO] 
------------------------------------------------------------------------
[INFO] Reactor Summary:
[INFO]
[INFO] parent ............................................ SUCCESS 
[14.147s]
[INFO] util .............................................. SUCCESS 
[43.131s]
[INFO] jevio ............................................. SUCCESS 
[6.611s]
[INFO] et ................................................ SUCCESS 
[5.080s]
[INFO] detector-data ..................................... SUCCESS 
[1.360s]
[INFO] conditions ........................................ FAILURE 
[1.729s]
[INFO] ecal-recon ........................................ SKIPPED
[INFO] ecal-readout-sim .................................. SKIPPED
[INFO] tracking .......................................... SKIPPED
[INFO] evio .............................................. SKIPPED
[INFO] recon ............................................. SKIPPED
[INFO] monitoring-drivers ................................ SKIPPED
[INFO] steering-files .................................... SKIPPED
[INFO] monitoring-app .................................... SKIPPED
[INFO] analysis .......................................... SKIPPED
[INFO] users ............................................. SKIPPED
[INFO] distribution ...................................... SKIPPED
[INFO] plugin ............................................ SKIPPED
[INFO] HPS Java Project .................................. SKIPPED
[INFO] 
------------------------------------------------------------------------
[INFO] BUILD FAILURE
[INFO] 
------------------------------------------------------------------------
[INFO] Total time: 1:14.453s
[INFO] Finished at: Thu Apr 03 18:04:33 CEST 2014
[INFO] Final Memory: 23M/144M
[INFO] 
------------------------------------------------------------------------
[ERROR] Failed to execute goal 
org.apache.maven.plugins:maven-compiler-plugin:3.1:compile 
(default-compile) on project hps-conditions: Compilation failure
[ERROR] 
/vol0/charlesg-l/Bureau/Docs/hps_db2/conditions/src/main/java/org/hps/conditions/ecal/EcalConditionsLoader.java:[35,20] 
cannot find symbol
[ERROR] symbol:   method reset()
[ERROR] location: variable crystal of type 
org.lcsim.detector.converter.compact.EcalCrystal
[ERROR] -> [Help 1]
[ERROR]
[ERROR] To see the full stack trace of the errors, re-run Maven with 
the -e switch.
[ERROR] Re-run Maven using the -X switch to enable full debug logging.
[ERROR]
[ERROR] For more information about the errors and possible solutions, 
please read the following articles:
[ERROR] [Help 1] 
http://cwiki.apache.org/confluence/display/MAVEN/MojoFailureException
[ERROR]
[ERROR] After correcting the problems, you can resume the build with 
the command
[ERROR]   mvn <goals> -rf :hps-conditions

-- 
Gabriel CHARLES
Institut de Physique Nucléaire d'Orsay

########################################################################
Use REPLY-ALL to reply to list

To unsubscribe from the HPS-SOFTWARE list, click the following link:
https://listserv.slac.stanford.edu/cgi-bin/wa?SUBED1=HPS-SOFTWARE&A=1