HPS-SOFTWARE Archives

Software for the Heavy Photon Search Experiment

HPS-SOFTWARE@LISTSERV.SLAC.STANFORD.EDU

Options: Use Forum View

Use Monospaced Font
Show Text Part by Default
Show All Mail Headers

Message: [<< First] [< Prev] [Next >] [Last >>]
Topic: [<< First] [< Prev] [Next >] [Last >>]
Author: [<< First] [< Prev] [Next >] [Last >>]

Print Reply
Subject:
From:
Annie Simonyan <[log in to unmask]>
Reply To:
Software for the Heavy Photon Search Experiment <[log in to unmask]>
Date:
Mon, 26 Oct 2015 22:25:14 -0400
Content-Type:
multipart/mixed
Parts/Attachments:
text/plain (1467 bytes) , error.txt (7 kB)
An update,
after cleaning my home and moving repo to local dir, as Jeremy said, it
went further, but was not so lucky to finish, new error from
"integration-tests".
(see attachment for details)

Thanks,
Annie.

> Probably it filled up your home dir because the jars go to ~/.m2 by
> default.
>
> You can change that with
>
> mvn -Dmaven.repo.local=/some/dir
>
> So you can use a dir with more space.
>
>> On Oct 26, 2015, at 8:52 PM, <[log in to unmask]> <[log in to unmask]> wrote:
>>
>> Hi,
>>
>> I am trying to run "mvn -Dskiptests" in hps_trunk and in lscim_trunk,
>> for both I get an error disk quota exceeded.
>> Any idea what is the problem?
>> "df -h" doesn't show anything suspicious.
>>
>> I am trying to run on ubuntu in orsay.
>>
>> Thanks,
>> Annie.
>>
>> ########################################################################
>> Use REPLY-ALL to reply to list
>>
>> To unsubscribe from the HPS-SOFTWARE list, click the following link:
>> https://listserv.slac.stanford.edu/cgi-bin/wa?SUBED1=HPS-SOFTWARE&A=1
>
> ########################################################################
> Use REPLY-ALL to reply to list
>
> To unsubscribe from the HPS-SOFTWARE list, click the following link:
> https://listserv.slac.stanford.edu/cgi-bin/wa?SUBED1=HPS-SOFTWARE&A=1
>

########################################################################
Use REPLY-ALL to reply to list

To unsubscribe from the HPS-SOFTWARE list, click the following link:
https://listserv.slac.stanford.edu/cgi-bin/wa?SUBED1=HPS-SOFTWARE&A=1



[INFO] integration-tests .................................. FAILURE [04:41 min] [INFO] plugin ............................................. SKIPPED [INFO] HPS Java Project ................................... SKIPPED [INFO] ------------------------------------------------------------------------ [INFO] BUILD FAILURE [INFO] ------------------------------------------------------------------------ [INFO] Total time: 09:31 min [INFO] Finished at: 2015-10-27T03:19:01+01:00 [INFO] Final Memory: 55M/546M [INFO] ------------------------------------------------------------------------ [ERROR] Failed to execute goal org.apache.maven.plugins:maven-surefire-plugin:2.18.1:test (default-test) on project hps-integration-tests: ExecutionException: java.lang.RuntimeException: The forked VM terminated without properly saying goodbye. VM crash or System.exit called? [ERROR] Command was /bin/sh -c cd /projet/nucleon2/annie/HPS/withHPS_Java/SENA/hps_trunk/integration-tests && /projet/nucleon2/annie/apps/java8/jdk1.8.0_60/jre/bin/java -Xmx1024m -jar /projet/nucleon2/annie/HPS/withHPS_Java/SENA/hps_trunk/integration-tests/target/surefire/surefirebooter4292616055402909329.jar /projet/nucleon2/annie/HPS/withHPS_Java/SENA/hps_trunk/integration-tests/target/surefire/surefire4340774143144658426tmp /projet/nucleon2/annie/HPS/withHPS_Java/SENA/hps_trunk/integration-tests/target/surefire/surefire_235779580839562906784tmp [ERROR] -> [Help 1] org.apache.maven.lifecycle.LifecycleExecutionException: Failed to execute goal org.apache.maven.plugins:maven-surefire-plugin:2.18.1:test (default-test) on project hps-integration-tests: ExecutionException at org.apache.maven.lifecycle.internal.MojoExecutor.execute(MojoExecutor.java:212) at org.apache.maven.lifecycle.internal.MojoExecutor.execute(MojoExecutor.java:153) at org.apache.maven.lifecycle.internal.MojoExecutor.execute(MojoExecutor.java:145) at org.apache.maven.lifecycle.internal.LifecycleModuleBuilder.buildProject(LifecycleModuleBuilder.java:116) at org.apache.maven.lifecycle.internal.LifecycleModuleBuilder.buildProject(LifecycleModuleBuilder.java:80) at org.apache.maven.lifecycle.internal.builder.singlethreaded.SingleThreadedBuilder.build(SingleThreadedBuilder.java:51) at org.apache.maven.lifecycle.internal.LifecycleStarter.execute(LifecycleStarter.java:128) at org.apache.maven.DefaultMaven.doExecute(DefaultMaven.java:307) at org.apache.maven.DefaultMaven.doExecute(DefaultMaven.java:193) at org.apache.maven.DefaultMaven.execute(DefaultMaven.java:106) at org.apache.maven.cli.MavenCli.execute(MavenCli.java:862) at org.apache.maven.cli.MavenCli.doMain(MavenCli.java:286) at org.apache.maven.cli.MavenCli.main(MavenCli.java:197) at sun.reflect.NativeMethodAccessorImpl.invoke0(Native Method) at sun.reflect.NativeMethodAccessorImpl.invoke(NativeMethodAccessorImpl.java:62) at sun.reflect.DelegatingMethodAccessorImpl.invoke(DelegatingMethodAccessorImpl.java:43) at java.lang.reflect.Method.invoke(Method.java:497) at org.codehaus.plexus.classworlds.launcher.Launcher.launchEnhanced(Launcher.java:289) at org.codehaus.plexus.classworlds.launcher.Launcher.launch(Launcher.java:229) at org.codehaus.plexus.classworlds.launcher.Launcher.mainWithExitCode(Launcher.java:415) at org.codehaus.plexus.classworlds.launcher.Launcher.main(Launcher.java:356) Caused by: org.apache.maven.plugin.MojoFailureException: ExecutionException at org.apache.maven.plugin.surefire.SurefirePlugin.assertNoException(SurefirePlugin.java:262) at org.apache.maven.plugin.surefire.SurefirePlugin.handleSummary(SurefirePlugin.java:252) at org.apache.maven.plugin.surefire.AbstractSurefireMojo.executeAfterPreconditionsChecked(AbstractSurefireMojo.java:854) at org.apache.maven.plugin.surefire.AbstractSurefireMojo.execute(AbstractSurefireMojo.java:722) at org.apache.maven.plugin.DefaultBuildPluginManager.executeMojo(DefaultBuildPluginManager.java:134) at org.apache.maven.lifecycle.internal.MojoExecutor.execute(MojoExecutor.java:208) ... 20 more Caused by: org.apache.maven.surefire.booter.SurefireBooterForkException: ExecutionException at org.apache.maven.plugin.surefire.booterclient.ForkStarter.runSuitesForkPerTestSet(ForkStarter.java:343) at org.apache.maven.plugin.surefire.booterclient.ForkStarter.run(ForkStarter.java:178) at org.apache.maven.plugin.surefire.AbstractSurefireMojo.executeProvider(AbstractSurefireMojo.java:990) at org.apache.maven.plugin.surefire.AbstractSurefireMojo.executeAfterPreconditionsChecked(AbstractSurefireMojo.java:824) ... 23 more Caused by: java.util.concurrent.ExecutionException: java.lang.RuntimeException: The forked VM terminated without properly saying goodbye. VM crash or System.exit called? Command was /bin/sh -c cd /projet/nucleon2/annie/HPS/withHPS_Java/SENA/hps_trunk/integration-tests && /projet/nucleon2/annie/apps/java8/jdk1.8.0_60/jre/bin/java -Xmx1024m -jar /projet/nucleon2/annie/HPS/withHPS_Java/SENA/hps_trunk/integration-tests/target/surefire/surefirebooter4292616055402909329.jar /projet/nucleon2/annie/HPS/withHPS_Java/SENA/hps_trunk/integration-tests/target/surefire/surefire4340774143144658426tmp /projet/nucleon2/annie/HPS/withHPS_Java/SENA/hps_trunk/integration-tests/target/surefire/surefire_235779580839562906784tmp at java.util.concurrent.FutureTask.report(FutureTask.java:122) at java.util.concurrent.FutureTask.get(FutureTask.java:192) at org.apache.maven.plugin.surefire.booterclient.ForkStarter.runSuitesForkPerTestSet(ForkStarter.java:327) ... 26 more Caused by: java.lang.RuntimeException: The forked VM terminated without properly saying goodbye. VM crash or System.exit called? Command was /bin/sh -c cd /projet/nucleon2/annie/HPS/withHPS_Java/SENA/hps_trunk/integration-tests && /projet/nucleon2/annie/apps/java8/jdk1.8.0_60/jre/bin/java -Xmx1024m -jar /projet/nucleon2/annie/HPS/withHPS_Java/SENA/hps_trunk/integration-tests/target/surefire/surefirebooter4292616055402909329.jar /projet/nucleon2/annie/HPS/withHPS_Java/SENA/hps_trunk/integration-tests/target/surefire/surefire4340774143144658426tmp /projet/nucleon2/annie/HPS/withHPS_Java/SENA/hps_trunk/integration-tests/target/surefire/surefire_235779580839562906784tmp at org.apache.maven.plugin.surefire.booterclient.ForkStarter.fork(ForkStarter.java:515) at org.apache.maven.plugin.surefire.booterclient.ForkStarter.fork(ForkStarter.java:380) at org.apache.maven.plugin.surefire.booterclient.ForkStarter.access$300(ForkStarter.java:88) at org.apache.maven.plugin.surefire.booterclient.ForkStarter$2.call(ForkStarter.java:315) at org.apache.maven.plugin.surefire.booterclient.ForkStarter$2.call(ForkStarter.java:306) at java.util.concurrent.FutureTask.run(FutureTask.java:266) at java.util.concurrent.ThreadPoolExecutor.runWorker(ThreadPoolExecutor.java:1142) at java.util.concurrent.ThreadPoolExecutor$Worker.run(ThreadPoolExecutor.java:617) at java.lang.Thread.run(Thread.java:745) [ERROR] [ERROR] Re-run Maven using the -X switch to enable full debug logging. [ERROR] [ERROR] For more information about the errors and possible solutions, please read the following articles: [ERROR] [Help 1] http://cwiki.apache.org/confluence/display/MAVEN/MojoFailureException [ERROR] [ERROR] After correcting the problems, you can resume the build with the command [ERROR] mvn <goals> -rf :hps-integration-tests [simonyan@ipnphase11 hps_trunk]$ ######################################################################## Use REPLY-ALL to reply to list To unsubscribe from the HPS-SOFTWARE list, click the following link: https://listserv.slac.stanford.edu/cgi-bin/wa?SUBED1=HPS-SOFTWARE&A=1

ATOM RSS1 RSS2